real-a
type: LexicalEntry
canonical form: real
sense: https://en-word.net/lemma/real-a#01939402-a
part of speech: adjective

existent-a
type: LexicalEntry
canonical form: existent
sense: https://en-word.net/lemma/existent-a#01939402-a
part of speech: adjective

https://en-word.net/synset/01939402-a
type: LexicalConcept
in scheme: en-word.net
definition: being or occurring in fact or actuality; having verified existence; not illusory
example: real objects
example: real people, not ghosts
example: a film based on real life
example: a real illness
example: real humility
example: Life is real! Life is earnest!
  source: Longfellow
ili: i10598
lexfile: adj.all
part of speech: adjective
also: https://en-word.net/synset/00013179-a
also: https://en-word.net/synset/01119091-a
also: https://en-word.net/synset/01946601-a
also: https://en-word.net/synset/02186899-a
also: https://en-word.net/synset/00697192-a
attribute: 13978747-n
similar: 01939967-s
similar: 01940178-s
similar: 01940473-s
similar: 01940682-s
similar: 01940876-s