activated-a
type: LexicalEntry
canonical form: activated
sense: 01935325-s
part of speech: adjective

excited-a
type: LexicalEntry
canonical form: excited
sense: 01935325-s
part of speech: adjective

01935325-s
type: LexicalConcept
in scheme: en-word.net
definition: (of e.g. a molecule) made reactive or more reactive
ili: i10577
lexfile: adj.all
part of speech: adjective satellite
domain topic: 06100457-n
similar: https://en-word.net/synset/01935007-a