march-v
type: LexicalEntry
canonical form: march
sense: 01923384-v
part of speech: verb

01923384-v
type: LexicalConcept
in scheme: en-word.net
definition: walk fast, with regular or measured steps; walk with a stride
example: He marched into the classroom and announced the exam
example: The soldiers marched across the border
ili: i31312
lexfile: verb.motion
part of speech: verb
hypernym: 01908923-v