prowl-v
type: LexicalEntry
canonical form: prowl
sense: 01922297-v
part of speech: verb

01922297-v
type: LexicalConcept
in scheme: en-word.net
definition: move about in or as if in a predatory manner
example: The suspicious stranger prowls the streets of the town
ili: i31306
lexfile: verb.motion
part of speech: verb
hypernym: 01908923-v