soft-a
type: LexicalEntry
canonical form: soft
sense: 01921148-s
part of speech: adjective

01921148-s
type: LexicalConcept
in scheme: en-word.net
definition: using evidence not readily amenable to experimental verification or refutation
example: soft data
example: the soft sciences
ili: i10501
lexfile: adj.all
part of speech: adjective satellite
similar: https://en-word.net/synset/01920902-a