turn away-v
type: LexicalEntry
canonical form: turn away
sense: 01912802-v
part of speech: verb

01912802-v
type: LexicalConcept
in scheme: en-word.net
definition: move so as not face somebody or something
ili: i31256
lexfile: verb.motion
part of speech: verb
hypernym: 01911251-v