test-n
type: LexicalEntry
canonical form: test
sense: 01907340-n
part of speech: noun

01907340-n
type: LexicalConcept
in scheme: en-word.net
definition: a hard outer covering as of some amoebas and sea urchins
ili: i45344
lexfile: noun.animal
part of speech: noun
hypernym: 09280855-n