shell-n
type: LexicalEntry
canonical form: shell
sense: 01906823-n
part of speech: noun

01906823-n
type: LexicalConcept
in scheme: en-word.net
definition: the hard largely calcareous covering of a mollusc or a brachiopod
ili: i45341
lexfile: noun.animal
part of speech: noun
hypernym: 09280855-n