spine-n
type: LexicalEntry
canonical form: spine
sense: 01903129-n
part of speech: noun

01903129-n
type: LexicalConcept
in scheme: en-word.net
definition: a sharp rigid animal process or appendage; as a porcupine quill or a ridge on a bone or a ray of a fish fin
ili: i45316
lexfile: noun.animal
part of speech: noun
hypernym: 05477841-n