tapdance-v
type: LexicalEntry
canonical form: tapdance
sense: 01899750-v
part of speech: verb

tap-v
type: LexicalEntry
canonical form: tap
sense: 01899750-v
part of speech: verb

01899750-v
type: LexicalConcept
in scheme: en-word.net
definition: dance and make rhythmic clicking sounds by means of metal plates nailed to the sole of the dance shoes
example: Glover tapdances better than anybody
ili: i31187
lexfile: verb.motion
part of speech: verb
hypernym: 01712535-v