bump-v
type: LexicalEntry
canonical form: bump
sense: 01899376-v
part of speech: verb

01899376-v
type: LexicalConcept
in scheme: en-word.net
definition: dance erotically or dance with the pelvis thrust forward
example: bump and grind
ili: i31184
lexfile: verb.motion
part of speech: verb
hypernym: 01712535-v