flip-v
type: LexicalEntry
canonical form: flip
sense: 01897594-v
part of speech: verb

twitch-v
type: LexicalEntry
canonical form: twitch
sense: 01897594-v
part of speech: verb

01897594-v
type: LexicalConcept
in scheme: en-word.net
definition: toss with a sharp movement so as to cause to turn over in the air
ili: i31173
lexfile: verb.motion
part of speech: verb
hypernym: 01835473-v