glide-v
type: LexicalEntry
canonical form: glide
sense: 01891894-v
part of speech: verb

01891894-v
type: LexicalConcept
in scheme: en-word.net
definition: cause to move or pass silently, smoothly, or imperceptibly
ili: i31144
lexfile: verb.motion
part of speech: verb
hypernym: 01854282-v