buck-n
type: LexicalEntry
canonical form: buck
sense: 01890905-n
part of speech: noun

01890905-n
type: LexicalConcept
in scheme: en-word.net
definition: mature male of various mammals (especially deer or antelope)
ili: i45237
lexfile: noun.animal
part of speech: noun
hypernym: 01889397-n