transit-v
type: LexicalEntry
canonical form: transit
sense: 01871058-v
part of speech: verb

01871058-v
type: LexicalConcept
in scheme: en-word.net
definition: pass across (a sign or house of the zodiac) or pass across (the disk of a celestial body or the meridian of a place)
example: The comet will transit on September 11
ili: i31038
lexfile: verb.motion
part of speech: verb
hypernym: 02054081-v