bob-v
type: LexicalEntry
canonical form: bob
sense: 01869369-v
part of speech: verb

01869369-v
type: LexicalConcept
in scheme: en-word.net
definition: move up and down repeatedly in a quick, short movement
example: her rucksack bobbed gently on her back
ili: i31029
lexfile: verb.motion
part of speech: verb
hypernym: 01835473-v