transplant-v
type: LexicalEntry
canonical form: transplant
sense: 01859141-v
part of speech: verb

transfer-v
type: LexicalEntry
canonical form: transfer
sense: 01859141-v
part of speech: verb

01859141-v
type: LexicalConcept
in scheme: en-word.net
definition: lift and reset in another soil or situation
example: Transplant the young rice plants
ili: i30978
lexfile: verb.motion
part of speech: verb
hypernym: 02017423-v
similar: 02759130-v