suction-v
type: LexicalEntry
canonical form: suction
sense: 01858665-v
part of speech: verb

01858665-v
type: LexicalConcept
in scheme: en-word.net
definition: remove or draw away by the force of suction
example: the doctors had to suction the water from the patient's lungs
ili: i30975
lexfile: verb.motion
part of speech: verb
hypernym: 00173351-v
similar: 00073337-v