puzzle-v
type: LexicalEntry
canonical form: puzzle
sense: 01835250-v
part of speech: verb

01835250-v
type: LexicalConcept
in scheme: en-word.net
definition: be uncertain about; think about without fully understanding or being able to decide
example: We puzzled over her sudden departure
ili: i30885
lexfile: verb.emotion
part of speech: verb
hypernym: 00632042-v