spook-v
type: LexicalEntry
canonical form: spook
sense: 01834907-v
part of speech: verb

01834907-v
type: LexicalConcept
in scheme: en-word.net
definition: frighten or scare, and often provoke into a violent action
example: The noise spooked the horse
ili: i30883
lexfile: verb.emotion
part of speech: verb
hypernym: 01783082-v