salivate-v
type: LexicalEntry
canonical form: salivate
sense: 01831367-v
part of speech: verb

drool-v
type: LexicalEntry
canonical form: drool
sense: 01831367-v
part of speech: verb

01831367-v
type: LexicalConcept
in scheme: en-word.net
definition: be envious, desirous, eager for, or extremely happy about something
example: She was salivating over the raise she anticipated
ili: i30862
lexfile: verb.emotion
part of speech: verb
hypernym: 01831174-v