dither-v
type: LexicalEntry
canonical form: dither
sense: 01824127-v
part of speech: verb

01824127-v
type: LexicalConcept
in scheme: en-word.net
definition: act nervously; be undecided; be uncertain
ili: i30827
lexfile: verb.emotion
part of speech: verb
hypernym: 01771313-v