encourage-v
type: LexicalEntry
canonical form: encourage
sense: 01822202-v
part of speech: verb

01822202-v
type: LexicalConcept
in scheme: en-word.net
definition: inspire with confidence; give hope or courage to
ili: i30816
lexfile: verb.emotion
part of speech: verb
causes: 01815408-v
hypernym: 01816687-v