kill-v
type: LexicalEntry
canonical form: kill
sense: 01813584-v
part of speech: verb

01813584-v
type: LexicalConcept
in scheme: en-word.net
definition: overwhelm with hilarity, pleasure, or admiration
example: The comedian was so funny, he was killing me!
ili: i30775
lexfile: verb.emotion
part of speech: verb
hypernym: 01813288-v