tempt-v
type: LexicalEntry
canonical form: tempt
sense: 01811496-v
part of speech: verb

invite-v
type: LexicalEntry
canonical form: invite
sense: 01811496-v
part of speech: verb

01811496-v
type: LexicalConcept
in scheme: en-word.net
definition: give rise to a desire by being attractive or inviting
example: the window displays tempted the shoppers
ili: i30766
lexfile: verb.emotion
part of speech: verb
domain topic: 00845915-n
hypernym: 01765558-v