harsh-a
type: LexicalEntry
canonical form: harsh
sense: 01808909-s
part of speech: adjective

01808909-s
type: LexicalConcept
in scheme: en-word.net
definition: unpleasantly rough or jarring to the senses
example: the harsh cry of a blue jay
example: harsh cognac
example: the harsh white light makes you screw up your eyes
example: harsh irritating smoke filled the hallway
ili: i9905
lexfile: adj.all
part of speech: adjective satellite
similar: https://en-word.net/synset/01806732-a