preoccupy-v
type: LexicalEntry
canonical form: preoccupy
sense: 01787213-v
part of speech: verb

01787213-v
type: LexicalConcept
in scheme: en-word.net
definition: engage or engross the interest or attention of beforehand or occupy urgently or obsessively
example: His work preoccupies him
example: The matter preoccupies her completely — she cannot think of anything else
ili: i30650
lexfile: verb.emotion
part of speech: verb
hypernym: 02445887-v