overawe-v
type: LexicalEntry
canonical form: overawe
sense: 01783720-v
part of speech: verb

cow-v
type: LexicalEntry
canonical form: cow
sense: 01783720-v
part of speech: verb

01783720-v
type: LexicalConcept
in scheme: en-word.net
definition: subdue, restrain, or overcome by affecting with a feeling of awe; frighten (as with threats)
ili: i30632
lexfile: verb.emotion
part of speech: verb
hypernym: 01783561-v