private-a
type: LexicalEntry
canonical form: private
sense: 01773890-s
part of speech: adjective

intimate-a
type: LexicalEntry
canonical form: intimate
sense: 01773890-s
part of speech: adjective

01773890-s
type: LexicalConcept
in scheme: en-word.net
definition: concerning things deeply private and personal
example: intimate correspondence
example: private family matters
ili: i9707
lexfile: adj.all
part of speech: adjective satellite
similar: https://en-word.net/synset/01771841-a