compose-v
type: LexicalEntry
canonical form: compose
sense: 01769030-v
part of speech: verb

01769030-v
type: LexicalConcept
in scheme: en-word.net
definition: calm (someone, especially oneself); make quiet
example: She had to compose herself before she could reply to this terrible insult
ili: i30565
lexfile: verb.emotion
part of speech: verb
hypernym: 01768652-v