channelize-v
type: LexicalEntry
canonical form: channelize
sense: 01760865-v
part of speech: verb

channelise-v
type: LexicalEntry
canonical form: channelise
sense: 01760865-v
part of speech: verb

01760865-v
type: LexicalConcept
in scheme: en-word.net
definition: make a channel for; provide with a channel
example: channelize the country for better transportation
ili: i30528
lexfile: verb.creation
part of speech: verb
hypernym: 01658171-v