develop-v
type: LexicalEntry
canonical form: develop
sense: 01742655-v
part of speech: verb

01742655-v
type: LexicalConcept
in scheme: en-word.net
definition: make something new, such as a product or a mental or artistic creation
example: Her company developed a new kind of building material that withstands all kinds of weather
example: They developed a new technique
ili: i30431
lexfile: verb.creation
part of speech: verb
hypernym: 01757596-v
similar: 01742478-v