orthogonal-a
type: LexicalEntry
canonical form: orthogonal
sense: 01724877-s
part of speech: adjective

rectangular-a
type: LexicalEntry
canonical form: rectangular
sense: 01724877-s
part of speech: adjective

01724877-s
type: LexicalConcept
in scheme: en-word.net
definition: having a set of mutually perpendicular axes; meeting at right angles
example: wind and sea may displace the ship's center of gravity along three orthogonal axes
example: a rectangular Cartesian coordinate system
ili: i9437
lexfile: adj.all
part of speech: adjective satellite
similar: https://en-word.net/synset/01724515-a