realize-v
type: LexicalEntry
canonical form: realize
sense: 01711354-v
part of speech: verb

realise-v
type: LexicalEntry
canonical form: realise
sense: 01711354-v
part of speech: verb

01711354-v
type: LexicalConcept
in scheme: en-word.net
definition: expand or complete (a part in a piece of baroque music) by supplying the harmonies indicated in the figured bass
ili: i30284
lexfile: verb.creation
part of speech: verb
domain topic: 07034009-n
hypernym: 01711165-v