trace-v
type: LexicalEntry
canonical form: trace
sense: 01698271-v
part of speech: verb

01698271-v
type: LexicalConcept
in scheme: en-word.net
definition: copy by following the lines of the original drawing on a transparent sheet placed upon it; make a tracing of
example: trace a design
example: trace a pattern
ili: i30216
lexfile: verb.creation
part of speech: verb
hypernym: 01697776-v