right-a
type: LexicalEntry
canonical form: right
sense: 01698038-s
part of speech: adjective

01698038-s
type: LexicalConcept
in scheme: en-word.net
definition: (of the side of cloth or clothing) facing or intended to face outward
example: the right side of the cloth showed the pattern
example: be sure your shirt is right side out
ili: i9271
lexfile: adj.all
part of speech: adjective satellite
similar: https://en-word.net/synset/01697422-a