extracurricular-a
type: LexicalEntry
canonical form: extracurricular
sense: 01697764-s
part of speech: adjective

01697764-s
type: LexicalConcept
in scheme: en-word.net
definition: outside the regular duties of your job or profession
ili: i9269
lexfile: adj.all
part of speech: adjective satellite
similar: https://en-word.net/synset/01697422-a