diagram-v
type: LexicalEntry
canonical form: diagram
sense: 01697348-v
part of speech: verb

plot-v
type: LexicalEntry
canonical form: plot
sense: 01697348-v
part of speech: verb

01697348-v
type: LexicalConcept
in scheme: en-word.net
definition: make a schematic or technical drawing that shows interactions among variables or how something is constructed
ili: i30212
lexfile: verb.creation
part of speech: verb
hypernym: 01694189-v