portray-v
type: LexicalEntry
canonical form: portray
sense: 01692666-v
part of speech: verb

present-v
type: LexicalEntry
canonical form: present
sense: 01692666-v
part of speech: verb

01692666-v
type: LexicalConcept
in scheme: en-word.net
definition: represent abstractly, for example in a painting, drawing, or sculpture
example: The father is portrayed as a good-looking man in this painting
ili: i30187
lexfile: verb.creation
part of speech: verb
domain topic: 00935235-n
hypernym: 01690027-v