capture-v
type: LexicalEntry
canonical form: capture
sense: 01690521-v
part of speech: verb

01690521-v
type: LexicalConcept
in scheme: en-word.net
definition: succeed in representing or expressing something intangible
example: capture the essence of Spring
example: capture an idea
ili: i30178
lexfile: verb.creation
part of speech: verb
hypernym: 01690027-v