illuminate-v
type: LexicalEntry
canonical form: illuminate
sense: 01687653-v
part of speech: verb

01687653-v
type: LexicalConcept
in scheme: en-word.net
definition: add embellishments and paintings to (medieval manuscripts)
ili: i30167
lexfile: verb.creation
part of speech: verb
domain topic: 00935235-n
entails: 01688558-v
hypernym: 01679858-v