extrude-v
type: LexicalEntry
canonical form: extrude
sense: 01679675-v
part of speech: verb

squeeze out-v
type: LexicalEntry
canonical form: squeeze out
sense: 01679675-v
part of speech: verb

01679675-v
type: LexicalConcept
in scheme: en-word.net
definition: form or shape by forcing through an opening
example: extrude steel
ili: i30123
lexfile: verb.creation
part of speech: verb
hypernym: 01624592-v