raucous-a
type: LexicalEntry
canonical form: raucous
sense: 01671363-s
part of speech: adjective

rowdy-a
type: LexicalEntry
canonical form: rowdy
sense: 01671363-s
part of speech: adjective

01671363-s
type: LexicalConcept
in scheme: en-word.net
definition: disturbing the public peace; loud and rough
example: a raucous party
example: rowdy teenagers
ili: i9142
lexfile: adj.all
part of speech: adjective satellite
similar: https://en-word.net/synset/01670528-a