style-v
type: LexicalEntry
canonical form: style
sense: 01670789-v
part of speech: verb

01670789-v
type: LexicalConcept
in scheme: en-word.net
definition: make consistent with a certain fashion or style
example: Style my hair
example: style the dress
ili: i30069
lexfile: verb.creation
part of speech: verb
domain topic: 05758654-n
hypernym: 01620211-v