disconnected-a
type: LexicalEntry
canonical form: disconnected
sense: 01656051-s
part of speech: adjective

01656051-s
type: LexicalConcept
in scheme: en-word.net
definition: not plugged in or connected to a power source
example: the iron is disconnected
ili: i9048
lexfile: adj.all
part of speech: adjective satellite
similar: https://en-word.net/synset/01655911-a