impel-v
type: LexicalEntry
canonical form: impel
sense: 01653967-v
part of speech: verb

force-v
type: LexicalEntry
canonical form: force
sense: 01653967-v
part of speech: verb

01653967-v
type: LexicalConcept
in scheme: en-word.net
definition: urge or force (a person) to an action; constrain or motivate
ili: i29991
lexfile: verb.creation
part of speech: verb
hypernym: 01649143-v