stage-v
type: LexicalEntry
canonical form: stage
sense: 01651668-v
part of speech: verb

arrange-v
type: LexicalEntry
canonical form: arrange
sense: 01651668-v
part of speech: verb

01651668-v
type: LexicalConcept
in scheme: en-word.net
definition: plan, organize, and carry out (an event)
example: the neighboring tribe staged an invasion
ili: i29977
lexfile: verb.creation
part of speech: verb
hypernym: 01645456-v