formal-a
type: LexicalEntry
canonical form: formal
sense: 01637196-s
part of speech: adjective

01637196-s
type: LexicalConcept
in scheme: en-word.net
definition: characteristic of or befitting a person in authority
example: formal duties
example: a formal banquet
ili: i8937
lexfile: adj.all
part of speech: adjective satellite
similar: https://en-word.net/synset/01636580-a