offensive-a
type: LexicalEntry
canonical form: offensive
sense: 01635447-s
part of speech: adjective

violative-a
type: LexicalEntry
canonical form: violative
sense: 01635447-s
part of speech: adjective

01635447-s
type: LexicalConcept
in scheme: en-word.net
definition: violating or tending to violate or offend against
example: violative of the principles of liberty
example: considered such depravity offensive against all laws of humanity
ili: i8928
lexfile: adj.all
part of speech: adjective satellite
similar: https://en-word.net/synset/01635086-a