do-v
type: LexicalEntry
canonical form: do
sense: 01622033-v
part of speech: verb

make-v
type: LexicalEntry
canonical form: make
sense: 01622033-v
part of speech: verb

01622033-v
type: LexicalConcept
in scheme: en-word.net
definition: create or design, often in a certain way
example: Do my room in blue
example: I did this piece in wood to express my love for the forest
ili: i29854
lexfile: verb.creation
part of speech: verb
hypernym: 01643749-v